How To Fix Ant Taskdef Class Org.testng.testnganttask Cannot Be Found Tutorial

Home > Cannot Be > Ant Taskdef Class Org.testng.testnganttask Cannot Be Found

Ant Taskdef Class Org.testng.testnganttask Cannot Be Found


Hi Varun,What all jar files i needed for xslt report target?I have addes saxon and saxonliasion.but i am getting following errorjava.lang.AbstractMethodError: net.sf.saxon.dom.DOMObjectModel.isRecognizedNodeListClass(Ljava/lang/Class;) 3/7/13, 8:17 PM Sreekanth C said... Really appreciated!! 6/4/13, 4:50 PM karthikeyan said... Hay varun,I am trying to pull data from excel using jxl.I am able to do.But i am getting problem while I am working with multiple data sheets.In my scenario I have Share to Twitter Share to Facebook Share to Pinterest 150 comments : huahsin68 said... weblink

My Email ID: [email protected] 5/29/13, 6:53 PM nitin lakhanpal said... You will find index.html file InXSLT_Reportsfolder. Browse other questions tagged java ant task or ask your own question. Thanks AgainMaya 4/2/12, 4:47 PM Maya said...

TestNG by default only generates the testng.xml for the use of re-execution of failing and skipped cases.For custom report generation you can create a class by implementing the TestListnerClass of TestNG This comment has been removed by the author. 3/23/14, 4:23 PM ramya said... In this line i am getting error as BUILD FAILEDC:\ibc\SELENIUM\Workspace\BLUESKYAUTOMATION\build.xml:15: Reference C:/ibc/SELENIUM/Workspace/BLUESKYAUTOMATION/lib/SaxonLiaison not found.Total time: 1 second 11/10/12, 3:05 PM Varun Menon said...

Hi , I am getting this error and following is the my code:411: Fatal Error! Sele... I copied the above build.xml for my project,and executed it through eclipse,am not getting any report,just build successful message in eclipseGetting build.xml not found when i type ant in cmd promptWhat Taskdef Class Weblogic.ant.taskdefs.j2ee.appc Cannot Be Found Using The Classloader Antclassloader Hello Varun :can u plz help me regarding the below :Build .xml file content :I am able to compile it successfullyProblem:I'm getting error while running & reporting:[testng] Total tests run: 7,

What is the origin of the word "pilko"? Taskdef A Class Needed By Class Cannot Be Found Hi Varun,I was trying to automate few browser cases using android web driver & eclipse. Hi Varun,Thanks for such a informative blog..When i am using the above code, i am getting following error:java.lang.NoSuchMethodError:[B)IPlease let me know how to resolve it. 4/25/13, 5:03 PM Varun Menon website here Forum Index » JAIN SLEE Discussions Go to: Select a forum JAIN SLEE Discussions Rhino SLEE Discussions Rhino SIP Servlet Visual Service Architect (VSA) Discussions Sentinel Express Sentinel VoLTE Sentinel IPSMGW

If you are interested in looking at what we've done, running it, or commenting on it, please do the following: 1. Taskdef Classpath file:/F:/My_Space/ipl_SeleniumScript/trunk/seleniumtests/testng-results.xsl: line 690: Required attribute 'select' is missing. [xslt] : Error! Most probably the dir from where you are trying to read or write a file does not exist and hence you are getting this error. Storage of a material that passes through non-living matter Determine maximum frequency of input signal to make system LTI Why was Susan treated so unkindly?

Taskdef A Class Needed By Class Cannot Be Found

Even after compiling and running tests again and then I run the xslt report target to generate the report but the report is of the first run and is not getting I also see these in base testNG reports before converting them to XSLTAppreciate the helpThanks, Sarat 10/15/11, 4:52 AM Varun Menon said... @sd: Sorry for the late response. Re: Initial, simple implementation of TestNG-driven developer tests for GlassFish deployment now available » Back to List Archive Chronological | Threaded « Previous Message Next » « Previous Thread Next » Org Testng Testnganttask Jar Download See below the stack trace:java.lang.RuntimeException: java.lang.NullPointerException at org.testng.internal.MethodInvocationHelper.invokeDataProvider( at org.testng.internal.Parameters.handleParameters( at org.testng.internal.Invoker.handleParameters( at org.testng.internal.Invoker.createParameters( at org.testng.internal.Invoker.invokeTestMethods( at org.testng.internal.TestMethodWorker.invokeTestMethods( at at org.testng.TestRunner.privateRun( at at org.testng.SuiteRunner.runTest( at org.testng.SuiteRunner.runSequentially( at org.testng.SuiteRunner.privateRun( at

Could share your build.xml. 11/27/12, 2:33 PM Madhu said... The information is displayed for each test case and aggregated for the whole suite. I added the jar the ant file needed to a lib folder in the project (specifically mysql jdbc drivers). It provides a step-by-step guide that explains the different features Copyright © A Space for Automation Enthusiasts WP Theme by Simply WP | Blogger theme by BloggerThemes Using The Classloader Antclassloader Eclipse

Property${envng.S1AS_HOME}hasnotbeenset Buildsequencefortarget(s)`run-test'is[compile-tests,run-test] Completebuildsequenceis[compile-tests,run-test,test,] compile-tests: [javac]SessionTest.javaaddedasSessionTest.classdoesn'texist. [javac]DeploymentTest.javaaddedasDeploymentTest.classdoesn'texist. [javac] Compiling 2 source files to /export/home/sony/workspace/glassfish/appserv-tests/devtests/deployment/build [javac]Usingmoderncompiler dropping /export/home/sony/workspace/glassfish/appserv-tests/devtests/deployment/${envng.S1AS_HOME}/lib/ant/lib/ant.jar from path as it doesn't exist [javac]Compilationarguments: [javac]'-d' [javac] '/export/home/sony/workspace/glassfish/appserv-tests/devtests/deployment/build' [javac]'-classpath' [javac] '/export/home/sony/workspace/glassfish/appserv-tests/devtests/deployment/build:/export/home/sony/workspace/glassfish/appserv-tests/lib/testng.jar:/export/home/sony/builds/as/9.0/b40/jdk/lib/tools.jar:/export/home/sony/builds/as/9.0/b40/lib/ant/lib/ant-launcher.jar:/export/home/sony/builds/as/9.0/b40/lib/ant/lib/ant-jai.jar:/export/home/sony/builds/as/9.0/b40/lib/ant/lib/ant-antlr.jar:/export/home/sony/builds/as/9.0/b40/lib/ant/lib/ant-starteam.jar:/export/home/sony/builds/as/9.0/b40/lib/ant/lib/ant-icontract.jar:/export/home/sony/builds/as/9.0/b40/lib/ant/lib/ant-jdepend.jar:/export/home/sony/builds/as/9.0/b40/lib/ant/lib/ant-apache-oro.jar:/export/home/sony/builds/as/9.0/b40/lib/ant/lib/ant-trax.jar:/export/home/sony/builds/as/9.0/b40/lib/ant/lib/ant-apache-regexp.jar:/export/home/sony/builds/as/9.0/b40/lib/ant/lib/ant-jmf.jar:/export/home/sony/builds/as/9.0/b40/lib/ant/lib/ant-jsch.jar:/export/home/sony/builds/as/9.0/b40/lib/ant/lib/ant-apache-bsf.jar:/export/home/sony/builds/as/9.0/b40/lib/ant/lib/ant-netrexx.jar:/export/home/sony/builds/as/9.0/b40/lib/ant/lib/ant-swing.jar:/export/home/sony/builds/as/9.0/b40/lib/ant/lib/xercesImpl.jar:/export/home/sony/builds/as/9.0/b40/lib/ant/lib/ant-apache-bcel.jar:/export/home/sony/builds/as/9.0/b40/lib/ant/lib/ant-stylebook.jar:/export/home/sony/builds/as/9.0/b40/lib/ant/lib/ant-javamail.jar:/export/home/sony/builds/as/9.0/b40/lib/ant/lib/ant-junit.jar:/export/home/sony/builds/as/9.0/b40/lib/ant/lib/ant-xalan1.jar:/export/home/sony/builds/as/9.0/b40/lib/ant/lib/ant-commons-net.jar:/export/home/sony/builds/as/9.0/b40/lib/ant/lib/ant-commons-logging.jar:/export/home/sony/builds/as/9.0/b40/lib/ant/lib/ant-weblogic.jar:/export/home/sony/builds/as/9.0/b40/lib/ant/lib/ant-apache-log4j.jar:/export/home/sony/builds/as/9.0/b40/lib/ant/lib/ant.jar:/export/home/sony/builds/as/9.0/b40/lib/ant/lib/xml-apis.jar:/export/home/sony/builds/as/9.0/b40/lib/ant/lib/ant-vaj.jar:/export/home/sony/builds/as/9.0/b40/lib/ant/lib/ant-xslp.jar:/export/home/sony/builds/as/9.0/b40/lib/ant/lib/ant-nodeps.jar:/export/home/sony/builds/as/9.0/b40/lib/ant/lib/ant-apache-resolver.jar' [javac]'-sourcepath' [javac] It might be tricky if you update the jar to a new version... Solutions? check over here Is it possible to write division equation in more rows?

Hi Varun,I did run build.xml from terminal.Even if the testcase fails,TestNG prints the message "BUILD SUCCESSFUL".IS it the expected behaviour from TESTNG? 9/2/13, 2:03 PM Divya Raju said... Cannot Be Found Using The Classloader Antclassloader Eclipse more stack exchange communities company blog Stack Exchange Inbox Reputation and Badges sign up log in tour help Tour Start here for a quick overview of the site Help Center Detailed Check your before methods and the testng xml file. 9/15/13, 10:19 AM Divya Raju said...

Please install a SVG viewer for your browser.ReplyDeleteUnknown11 September 2016 at 23:46D:\backup\Training\WDDF>antBuildfile: build.xml does not exist!Build failedThe steps were carefully followed, build.xml has warning on the line 33 which says "taskdef

To use Google Groups Discussions, please enable JavaScript in your browser settings, and then refresh this page. . I can't continue with ant until this is corrected. Fortis15 April 2015 at 07:50Hi! Taskdef Class Com.intellij.ant.javac2 Cannot Be Found Hi Varun,I am trying to generate XSLT reports , but it was created empty output folder.Can you please help me. 10/14/15, 11:40 PM Unknown said...

help will be appreciated. 11/3/12, 4:33 PM Varun Menon said... I am using Ubuntu's libaxis-java package which installs axis-ant.jar in $ANT_HOME/lib and axis.jar in /usr/share/java. Iam getting this error,i used ur same code only..What is that ${REPORT}Iam fresher in selenium,can you help meBUILD FAILEDC:\Documents and Settings\Administrator\workspace\Ant_Project\src\tests\build.xml:4: input file C:\Documents and Settings\Administrator\workspace\Ant_Project\src\tests\${REPORT}\testNG-report\testing-result.xml does not exist 9/9/11, 12:19 These all methods are nested.

could you please let me know from where to download XSLT now? 5/2/13, 5:49 PM PRANAY DUA said... Delete the old report folder before execution start. 10/13/14, 5:50 PM Neela Anand said... From the error it shows that it is not able to locate slee-ant-tasks.jar, which is loded from common.xml, and located under RHINO_HOME/client/lib. It's only text. 12/16/11, 6:00 AM Bharath said...

You get this error when the saxon library is not set in the classpath. 7/19/13, 3:38 PM Neil said... Browse other questions tagged java ant classpath axis or ask your own question. Hi Varun,Really it's worth full content.It saved my time.Thanks a lot Varun... 11/27/12, 4:06 PM Selenium Export said... Why are password boxes always blanked out when other sensitive data isn't?

Without opening the PHB, is there a way to know if it's a particular printing? What exactly are sleeping stalls versus waiting-rooms, for airport layovers? In this step, We will learn how to generate XSLT reports for selenium software test data driven framework. share|improve this answer answered Jan 27 '09 at 5:05 OscarRyz 114k80291461 system.library.dir is a property that I defined, and is being used successfully by the classpathref in the javac

STAY HAPPY AND HEALTHY BY MAKING PEOPLE HAPPY AND HEALTHY." Template images by merrymoonmary. I was trying to follow all your mentioned step to generate the report, but could not able to. Hi Mr.Varun,I also used Ant, TestNG, TestNG XSLT to run my selenium test cases and generate xslt reports and was working perfect initially but all of a sudden may be after In my case it is the master-classpath.

Set Project Path : Go to your "WDDF" project directory In command prompt where your "build.xml" file Is stored as shown In bellow Image. Its uses the pure XSL for report generation and Saxon as an XSL2.0 implementation. In case you need to generate a custom report for Junit.